Local build failing

classic Classic list List threaded Threaded
8 messages Options
Reply | Threaded
Open this post in threaded view
|

Local build failing

Serge Eby-2
Hey Guys,

Is the master branch still in flux?
I get the following error when trying to build:

INFO] BUILD FAILURE
[INFO] ------------------------------------------------------------------------
[INFO] Total time: 01:02 min
[INFO] Finished at: 2015-01-19T15:46:55-08:00
[INFO] Final Memory: 87M/477M
[INFO] ------------------------------------------------------------------------
[ERROR] Failed to execute goal org.apache.maven.plugins:maven-surefire-plugin:2.17:test (default-test) on project appfuse-maven-plugin: There are test failures.
[ERROR]

--
Serge Eby
Reply | Threaded
Open this post in threaded view
|

Re: Local build failing

mraible
Administrator
Yes, I’m working on AMP support for AppFuse Light modules. However, it’s on a branch so shouldn’t matter. Will look into it now...

> On Jan 19, 2015, at 4:49 PM, Serge Eby <[hidden email]> wrote:
>
> Hey Guys,
>
> Is the master branch still in flux?
> I get the following error when trying to build:
>
> INFO] BUILD FAILURE
> [INFO] ------------------------------------------------------------------------
> [INFO] Total time: 01:02 min
> [INFO] Finished at: 2015-01-19T15:46:55-08:00
> [INFO] Final Memory: 87M/477M
> [INFO] ------------------------------------------------------------------------
> [ERROR] Failed to execute goal org.apache.maven.plugins:maven-surefire-plugin:2.17:test (default-test) on project appfuse-maven-plugin: There are test failures.
> [ERROR]
>
> --
> Serge Eby

Reply | Threaded
Open this post in threaded view
|

Re: Local build failing

mraible
Administrator
Seems to work for me running "mvn clean install -Pitest". Bamboo seems good too: http://builds.appfuse.org/allPlans.action

[INFO] ------------------------------------------------------------------------
[INFO] Reactor Summary:
[INFO]
[INFO] AppFuse JSF Module ................................. SUCCESS [01:01 min]
[INFO] AppFuse Spring MVC Module .......................... SUCCESS [ 51.377 s]
[INFO] AppFuse Struts 2 Module ............................ SUCCESS [ 43.866 s]
[INFO] AppFuse Tapestry Module ............................ SUCCESS [01:01 min]
[INFO] AppFuse Wicket Module .............................. SUCCESS [ 40.837 s]
[INFO] AppFuse GWT Module ................................. SUCCESS [01:47 min]
[INFO] AppFuse Archetype Modules .......................... SUCCESS [  0.016 s]
[INFO] AppFuse Core Archetype ............................. SUCCESS [ 19.394 s]
[INFO] AppFuse Basic Archetype - JSF ...................... SUCCESS [01:18 min]
[INFO] AppFuse Basic Archetype - Spring MVC ............... SUCCESS [01:15 min]
[INFO] AppFuse Basic Archetype - Struts ................... SUCCESS [01:08 min]
[INFO] AppFuse Basic Archetype - Tapestry ................. SUCCESS [01:22 min]
[INFO] AppFuse Basic Archetype - Wicket ................... SUCCESS [06:16 min]
[INFO] AppFuse Basic Archetype - GWT ...................... SUCCESS [02:18 min]
[INFO] AppFuse Modular Archetype - JSF .................... SUCCESS [01:19 min]
[INFO] AppFuse Modular Archetype - Struts ................. SUCCESS [01:11 min]
[INFO] AppFuse Modular Archetype - Spring ................. SUCCESS [01:14 min]
[INFO] AppFuse Modular Archetype - Tapestry ............... SUCCESS [01:23 min]
[INFO] AppFuse Modular Archetype - Wicket ................. SUCCESS [01:05 min]
[INFO] AppFuse Modular Archetype - GWT .................... SUCCESS [02:12 min]
[INFO] AppFuse Web Services Archetype ..................... SUCCESS [ 24.459 s]
[INFO] Maven WarPath Plugin ............................... SUCCESS [  1.805 s]
[INFO] ------------------------------------------------------------------------
[INFO] BUILD SUCCESS
[INFO] ------------------------------------------------------------------------
[INFO] Total time: 29:00 min
[INFO] Finished at: 2015-01-19T17:48:45-07:00
[INFO] Final Memory: 159M/535M
[INFO] ------------------------------------------------------------------------
⌁49% ⌂95% [mraible:~/dev/appfuse] master 29m3s ±

On Mon, Jan 19, 2015 at 4:53 PM, Matt Raible <[hidden email]> wrote:
Yes, I’m working on AMP support for AppFuse Light modules. However, it’s on a branch so shouldn’t matter. Will look into it now...

> On Jan 19, 2015, at 4:49 PM, Serge Eby <[hidden email]> wrote:
>
> Hey Guys,
>
> Is the master branch still in flux?
> I get the following error when trying to build:
>
> INFO] BUILD FAILURE
> [INFO] ------------------------------------------------------------------------
> [INFO] Total time: 01:02 min
> [INFO] Finished at: 2015-01-19T15:46:55-08:00
> [INFO] Final Memory: 87M/477M
> [INFO] ------------------------------------------------------------------------
> [ERROR] Failed to execute goal org.apache.maven.plugins:maven-surefire-plugin:2.17:test (default-test) on project appfuse-maven-plugin: There are test failures.
> [ERROR]
>
> --
> Serge Eby


Reply | Threaded
Open this post in threaded view
|

Re: Local build failing

Serge Eby-2
Ok, I will try again with the -Pitest flag. I have a new machine, so maybe I have something wrong on my end.

Serge

On Monday, January 19, 2015, Matt Raible <[hidden email]> wrote:
Seems to work for me running "mvn clean install -Pitest". Bamboo seems good too: http://builds.appfuse.org/allPlans.action

[INFO] ------------------------------------------------------------------------
[INFO] Reactor Summary:
[INFO]
[INFO] AppFuse JSF Module ................................. SUCCESS [01:01 min]
[INFO] AppFuse Spring MVC Module .......................... SUCCESS [ 51.377 s]
[INFO] AppFuse Struts 2 Module ............................ SUCCESS [ 43.866 s]
[INFO] AppFuse Tapestry Module ............................ SUCCESS [01:01 min]
[INFO] AppFuse Wicket Module .............................. SUCCESS [ 40.837 s]
[INFO] AppFuse GWT Module ................................. SUCCESS [01:47 min]
[INFO] AppFuse Archetype Modules .......................... SUCCESS [  0.016 s]
[INFO] AppFuse Core Archetype ............................. SUCCESS [ 19.394 s]
[INFO] AppFuse Basic Archetype - JSF ...................... SUCCESS [01:18 min]
[INFO] AppFuse Basic Archetype - Spring MVC ............... SUCCESS [01:15 min]
[INFO] AppFuse Basic Archetype - Struts ................... SUCCESS [01:08 min]
[INFO] AppFuse Basic Archetype - Tapestry ................. SUCCESS [01:22 min]
[INFO] AppFuse Basic Archetype - Wicket ................... SUCCESS [06:16 min]
[INFO] AppFuse Basic Archetype - GWT ...................... SUCCESS [02:18 min]
[INFO] AppFuse Modular Archetype - JSF .................... SUCCESS [01:19 min]
[INFO] AppFuse Modular Archetype - Struts ................. SUCCESS [01:11 min]
[INFO] AppFuse Modular Archetype - Spring ................. SUCCESS [01:14 min]
[INFO] AppFuse Modular Archetype - Tapestry ............... SUCCESS [01:23 min]
[INFO] AppFuse Modular Archetype - Wicket ................. SUCCESS [01:05 min]
[INFO] AppFuse Modular Archetype - GWT .................... SUCCESS [02:12 min]
[INFO] AppFuse Web Services Archetype ..................... SUCCESS [ 24.459 s]
[INFO] Maven WarPath Plugin ............................... SUCCESS [  1.805 s]
[INFO] ------------------------------------------------------------------------
[INFO] BUILD SUCCESS
[INFO] ------------------------------------------------------------------------
[INFO] Total time: 29:00 min
[INFO] Finished at: 2015-01-19T17:48:45-07:00
[INFO] Final Memory: 159M/535M
[INFO] ------------------------------------------------------------------------
⌁49% ⌂95% [mraible:~/dev/appfuse] master 29m3s ±

On Mon, Jan 19, 2015 at 4:53 PM, Matt Raible <<a href="javascript:_e(%7B%7D,&#39;cvml&#39;,&#39;matt@raibledesigns.com&#39;);" target="_blank">matt@...> wrote:
Yes, I’m working on AMP support for AppFuse Light modules. However, it’s on a branch so shouldn’t matter. Will look into it now...

> On Jan 19, 2015, at 4:49 PM, Serge Eby <<a href="javascript:_e(%7B%7D,&#39;cvml&#39;,&#39;serge.eby@gmail.com&#39;);" target="_blank">serge.eby@...> wrote:
>
> Hey Guys,
>
> Is the master branch still in flux?
> I get the following error when trying to build:
>
> INFO] BUILD FAILURE
> [INFO] ------------------------------------------------------------------------
> [INFO] Total time: 01:02 min
> [INFO] Finished at: 2015-01-19T15:46:55-08:00
> [INFO] Final Memory: 87M/477M
> [INFO] ------------------------------------------------------------------------
> [ERROR] Failed to execute goal org.apache.maven.plugins:maven-surefire-plugin:2.17:test (default-test) on project appfuse-maven-plugin: There are test failures.
> [ERROR]
>
> --
> Serge Eby




--
---
Serge Eby
Reply | Threaded
Open this post in threaded view
|

Re: Local build failing

Serge Eby-2
In reply to this post by mraible
Just to follow up on my previous email, it's still failing for me :(
Which versions of Maven & JDK are you using?

Some info on my settings:

$ mvn -version
Apache Maven 3.2.5 (12a6b3acb947671f09b81f49094c53f426d8cea1; 2014-12-14T09:29:23-08:00)
Maven home: /usr/local/maven
Java version: 1.7.0_71, vendor: Oracle Corporation
Java home: /Library/Java/JavaVirtualMachines/jdk1.7.0_71.jdk/Contents/Home/jre
Default locale: en_US, platform encoding: UTF-8
OS name: "mac os x", version: "10.10.1", arch: "x86_64", family: "mac"


$ ant -version
Apache Ant(TM) version 1.9.4 compiled on April 29 2014

-----------
Error message:

[ERROR] The desired archetype does not exist (org.appfuse.archetypes:appfuse-basic-struts-archetype:3.5.0-SNAPSHOT)
org.apache.maven.archetype.exception.UnknownArchetype: The desired archetype does not exist (org.appfuse.archetypes:appfuse-basic-struts-archetype:3.5.0-SNAPSHOT)
at org.apache.maven.archetype.generator.DefaultArchetypeGenerator.generateArchetype(DefaultArchetypeGenerator.java:112)
at org.apache.maven.archetype.generator.DefaultArchetypeGenerator.generateArchetype(DefaultArchetypeGenerator.java:286)
at org.apache.maven.archetype.DefaultArchetype.generateProjectFromArchetype(DefaultArchetype.java:69)
at org.appfuse.mojo.AbstractAppFuseMojoTestCase.createTestProject(AbstractAppFuseMojoTestCase.java:136)
at org.appfuse.mojo.installer.InstallArtifactsMojoTest.testCreateStrutsProject(InstallArtifactsMojoTest.java:8)
at sun.reflect.NativeMethodAccessorImpl.invoke0(Native Method)
at sun.reflect.NativeMethodAccessorImpl.invoke(NativeMethodAccessorImpl.java:57)
at sun.reflect.DelegatingMethodAccessorImpl.invoke(DelegatingMethodAccessorImpl.java:43)
at java.lang.reflect.Method.invoke(Method.java:606)
at junit.framework.TestCase.runTest(TestCase.java:176)
at junit.framework.TestCase.runBare(TestCase.java:141)
at junit.framework.TestResult$1.protect(TestResult.java:122)
at junit.framework.TestResult.runProtected(TestResult.java:142)
at junit.framework.TestResult.run(TestResult.java:125)
at junit.framework.TestCase.run(TestCase.java:129)
at junit.framework.TestSuite.runTest(TestSuite.java:252)
at junit.framework.TestSuite.run(TestSuite.java:247)
at org.junit.internal.runners.JUnit38ClassRunner.run(JUnit38ClassRunner.java:86)
at org.apache.maven.surefire.junit4.JUnit4Provider.execute(JUnit4Provider.java:264)
at org.apache.maven.surefire.junit4.JUnit4Provider.executeTestSet(JUnit4Provider.java:153)
at org.apache.maven.surefire.junit4.JUnit4Provider.invoke(JUnit4Provider.java:124)
at org.apache.maven.surefire.booter.ForkedBooter.invokeProviderInSameClassLoader(ForkedBooter.java:200)
at org.apache.maven.surefire.booter.ForkedBooter.runSuitesInProcess(ForkedBooter.java:153)
at org.apache.maven.surefire.booter.ForkedBooter.main(ForkedBooter.java:103)
Tests run: 1, Failures: 1, Errors: 0, Skipped: 0, Time elapsed: 0.494 sec <<< FAILURE! - in org.appfuse.mojo.installer.InstallArtifactsMojoTest
testCreateStrutsProject(org.appfuse.mojo.installer.InstallArtifactsMojoTest)  Time elapsed: 0.453 sec  <<< FAILURE!
junit.framework.AssertionFailedError: can't find test-project's pom.xml
at junit.framework.Assert.fail(Assert.java:57)
at junit.framework.Assert.assertTrue(Assert.java:22)
at junit.framework.TestCase.assertTrue(TestCase.java:192)
at org.appfuse.mojo.installer.InstallArtifactsMojoTest.testCreateStrutsProject(InstallArtifactsMojoTest.java:9)

Running org.appfuse.tool.DataHelperTest
Tests run: 1, Failures: 0, Errors: 0, Skipped: 0, Time elapsed: 0.438 sec - in org.appfuse.tool.DataHelperTest
Running org.appfuse.tool.StringUtilsTest
Tests run: 1, Failures: 0, Errors: 0, Skipped: 0, Time elapsed: 0.032 sec - in org.appfuse.tool.StringUtilsTest

Results :

Failed tests:
  InstallArtifactsMojoTest.testCreateStrutsProject:9 can't find test-project's pom.xml
Tests run: 27, Failures: 1, Errors: 0, Skipped: 0

[INFO] ------------------------------------------------------------------------
[INFO] Reactor Summary:
[INFO]
[INFO] AppFuse ............................................ SUCCESS [  0.452 s]
[INFO] AppFuse Data Modules ............................... SUCCESS [  0.008 s]
[INFO] AppFuse Common Data Module ......................... SUCCESS [  1.587 s]
[INFO] AppFuse Hibernate Module ........................... SUCCESS [  6.741 s]
[INFO] AppFuse JPA Module ................................. SUCCESS [  4.823 s]
[INFO] AppFuse Service Module ............................. SUCCESS [  7.063 s]
[INFO] AppFuse Plugin Modules ............................. SUCCESS [  0.006 s]
[INFO] AppFuse Maven Plugin ............................... FAILURE [ 37.356 s]
[INFO] AppFuse Web Modules ................................ SKIPPED
[INFO] AppFuse Common Web Module .......................... SKIPPED
[INFO] AppFuse JSF Module ................................. SKIPPED
[INFO] AppFuse Spring MVC Module .......................... SKIPPED
[INFO] AppFuse Struts 2 Module ............................ SKIPPED
[INFO] AppFuse Tapestry Module ............................ SKIPPED
[INFO] AppFuse Wicket Module .............................. SKIPPED
[INFO] AppFuse GWT Module ................................. SKIPPED
[INFO] AppFuse Archetype Modules .......................... SKIPPED
[INFO] AppFuse Core Archetype ............................. SKIPPED
[INFO] AppFuse Basic Archetype - JSF ...................... SKIPPED
[INFO] AppFuse Basic Archetype - Spring MVC ............... SKIPPED
[INFO] AppFuse Basic Archetype - Struts ................... SKIPPED
[INFO] AppFuse Basic Archetype - Tapestry ................. SKIPPED
[INFO] AppFuse Basic Archetype - Wicket ................... SKIPPED
[INFO] AppFuse Basic Archetype - GWT ...................... SKIPPED
[INFO] AppFuse Modular Archetype - JSF .................... SKIPPED
[INFO] AppFuse Modular Archetype - Struts ................. SKIPPED
[INFO] AppFuse Modular Archetype - Spring ................. SKIPPED
[INFO] AppFuse Modular Archetype - Tapestry ............... SKIPPED
[INFO] AppFuse Modular Archetype - Wicket ................. SKIPPED
[INFO] AppFuse Modular Archetype - GWT .................... SKIPPED
[INFO] AppFuse Web Services Archetype ..................... SKIPPED
[INFO] Maven WarPath Plugin ............................... SKIPPED
[INFO] ------------------------------------------------------------------------
[INFO] BUILD FAILURE
[INFO] ------------------------------------------------------------------------
[INFO] Total time: 59.449 s
[INFO] Finished at: 2015-01-19T17:56:55-08:00
[INFO] Final Memory: 88M/479M
[INFO] ------------------------------------------------------------------------


On Mon, Jan 19, 2015 at 4:56 PM, Matt Raible <[hidden email]> wrote:
Seems to work for me running "mvn clean install -Pitest". Bamboo seems good too: http://builds.appfuse.org/allPlans.action

[INFO] ------------------------------------------------------------------------
[INFO] Reactor Summary:
[INFO]
[INFO] AppFuse JSF Module ................................. SUCCESS [01:01 min]
[INFO] AppFuse Spring MVC Module .......................... SUCCESS [ 51.377 s]
[INFO] AppFuse Struts 2 Module ............................ SUCCESS [ 43.866 s]
[INFO] AppFuse Tapestry Module ............................ SUCCESS [01:01 min]
[INFO] AppFuse Wicket Module .............................. SUCCESS [ 40.837 s]
[INFO] AppFuse GWT Module ................................. SUCCESS [01:47 min]
[INFO] AppFuse Archetype Modules .......................... SUCCESS [  0.016 s]
[INFO] AppFuse Core Archetype ............................. SUCCESS [ 19.394 s]
[INFO] AppFuse Basic Archetype - JSF ...................... SUCCESS [01:18 min]
[INFO] AppFuse Basic Archetype - Spring MVC ............... SUCCESS [01:15 min]
[INFO] AppFuse Basic Archetype - Struts ................... SUCCESS [01:08 min]
[INFO] AppFuse Basic Archetype - Tapestry ................. SUCCESS [01:22 min]
[INFO] AppFuse Basic Archetype - Wicket ................... SUCCESS [06:16 min]
[INFO] AppFuse Basic Archetype - GWT ...................... SUCCESS [02:18 min]
[INFO] AppFuse Modular Archetype - JSF .................... SUCCESS [01:19 min]
[INFO] AppFuse Modular Archetype - Struts ................. SUCCESS [01:11 min]
[INFO] AppFuse Modular Archetype - Spring ................. SUCCESS [01:14 min]
[INFO] AppFuse Modular Archetype - Tapestry ............... SUCCESS [01:23 min]
[INFO] AppFuse Modular Archetype - Wicket ................. SUCCESS [01:05 min]
[INFO] AppFuse Modular Archetype - GWT .................... SUCCESS [02:12 min]
[INFO] AppFuse Web Services Archetype ..................... SUCCESS [ 24.459 s]
[INFO] Maven WarPath Plugin ............................... SUCCESS [  1.805 s]
[INFO] ------------------------------------------------------------------------
[INFO] BUILD SUCCESS
[INFO] ------------------------------------------------------------------------
[INFO] Total time: 29:00 min
[INFO] Finished at: 2015-01-19T17:48:45-07:00
[INFO] Final Memory: 159M/535M
[INFO] ------------------------------------------------------------------------
⌁49% ⌂95% [mraible:~/dev/appfuse] master 29m3s ±

On Mon, Jan 19, 2015 at 4:53 PM, Matt Raible <[hidden email]> wrote:
Yes, I’m working on AMP support for AppFuse Light modules. However, it’s on a branch so shouldn’t matter. Will look into it now...

> On Jan 19, 2015, at 4:49 PM, Serge Eby <[hidden email]> wrote:
>
> Hey Guys,
>
> Is the master branch still in flux?
> I get the following error when trying to build:
>
> INFO] BUILD FAILURE
> [INFO] ------------------------------------------------------------------------
> [INFO] Total time: 01:02 min
> [INFO] Finished at: 2015-01-19T15:46:55-08:00
> [INFO] Final Memory: 87M/477M
> [INFO] ------------------------------------------------------------------------
> [ERROR] Failed to execute goal org.apache.maven.plugins:maven-surefire-plugin:2.17:test (default-test) on project appfuse-maven-plugin: There are test failures.
> [ERROR]
>
> --
> Serge Eby





--
Serge Eby
Reply | Threaded
Open this post in threaded view
|

Re: Local build failing

mraible
Administrator
I’m using an older version:

$ mvn -version
Apache Maven 3.2.3 (33f8c3e1027c3ddde99d3cdebad2656a31e8fdf4; 2014-08-11T14:58:10-06:00)
Maven home: /opt/tools/maven
Java version: 1.7.0_51, vendor: Oracle Corporation
Java home: /Library/Java/JavaVirtualMachines/jdk1.7.0_51.jdk/Contents/Home/jre
Default locale: en_US, platform encoding: UTF-8
OS name: "mac os x", version: "10.10.1", arch: "x86_64", family: “mac"

I’ll try upgrading and see if I can reproduce.

On Jan 19, 2015, at 7:19 PM, Serge Eby <[hidden email]> wrote:

Just to follow up on my previous email, it's still failing for me :(
Which versions of Maven & JDK are you using?

Some info on my settings:

$ mvn -version
Apache Maven 3.2.5 (12a6b3acb947671f09b81f49094c53f426d8cea1; 2014-12-14T09:29:23-08:00)
Maven home: /usr/local/maven
Java version: 1.7.0_71, vendor: Oracle Corporation
Java home: /Library/Java/JavaVirtualMachines/jdk1.7.0_71.jdk/Contents/Home/jre
Default locale: en_US, platform encoding: UTF-8
OS name: "mac os x", version: "10.10.1", arch: "x86_64", family: "mac"


$ ant -version
Apache Ant(TM) version 1.9.4 compiled on April 29 2014

-----------
Error message:

[ERROR] The desired archetype does not exist (org.appfuse.archetypes:appfuse-basic-struts-archetype:3.5.0-SNAPSHOT)
org.apache.maven.archetype.exception.UnknownArchetype: The desired archetype does not exist (org.appfuse.archetypes:appfuse-basic-struts-archetype:3.5.0-SNAPSHOT)
at org.apache.maven.archetype.generator.DefaultArchetypeGenerator.generateArchetype(DefaultArchetypeGenerator.java:112)
at org.apache.maven.archetype.generator.DefaultArchetypeGenerator.generateArchetype(DefaultArchetypeGenerator.java:286)
at org.apache.maven.archetype.DefaultArchetype.generateProjectFromArchetype(DefaultArchetype.java:69)
at org.appfuse.mojo.AbstractAppFuseMojoTestCase.createTestProject(AbstractAppFuseMojoTestCase.java:136)
at org.appfuse.mojo.installer.InstallArtifactsMojoTest.testCreateStrutsProject(InstallArtifactsMojoTest.java:8)
at sun.reflect.NativeMethodAccessorImpl.invoke0(Native Method)
at sun.reflect.NativeMethodAccessorImpl.invoke(NativeMethodAccessorImpl.java:57)
at sun.reflect.DelegatingMethodAccessorImpl.invoke(DelegatingMethodAccessorImpl.java:43)
at java.lang.reflect.Method.invoke(Method.java:606)
at junit.framework.TestCase.runTest(TestCase.java:176)
at junit.framework.TestCase.runBare(TestCase.java:141)
at junit.framework.TestResult$1.protect(TestResult.java:122)
at junit.framework.TestResult.runProtected(TestResult.java:142)
at junit.framework.TestResult.run(TestResult.java:125)
at junit.framework.TestCase.run(TestCase.java:129)
at junit.framework.TestSuite.runTest(TestSuite.java:252)
at junit.framework.TestSuite.run(TestSuite.java:247)
at org.junit.internal.runners.JUnit38ClassRunner.run(JUnit38ClassRunner.java:86)
at org.apache.maven.surefire.junit4.JUnit4Provider.execute(JUnit4Provider.java:264)
at org.apache.maven.surefire.junit4.JUnit4Provider.executeTestSet(JUnit4Provider.java:153)
at org.apache.maven.surefire.junit4.JUnit4Provider.invoke(JUnit4Provider.java:124)
at org.apache.maven.surefire.booter.ForkedBooter.invokeProviderInSameClassLoader(ForkedBooter.java:200)
at org.apache.maven.surefire.booter.ForkedBooter.runSuitesInProcess(ForkedBooter.java:153)
at org.apache.maven.surefire.booter.ForkedBooter.main(ForkedBooter.java:103)
Tests run: 1, Failures: 1, Errors: 0, Skipped: 0, Time elapsed: 0.494 sec <<< FAILURE! - in org.appfuse.mojo.installer.InstallArtifactsMojoTest
testCreateStrutsProject(org.appfuse.mojo.installer.InstallArtifactsMojoTest)  Time elapsed: 0.453 sec  <<< FAILURE!
junit.framework.AssertionFailedError: can't find test-project's pom.xml
at junit.framework.Assert.fail(Assert.java:57)
at junit.framework.Assert.assertTrue(Assert.java:22)
at junit.framework.TestCase.assertTrue(TestCase.java:192)
at org.appfuse.mojo.installer.InstallArtifactsMojoTest.testCreateStrutsProject(InstallArtifactsMojoTest.java:9)

Running org.appfuse.tool.DataHelperTest
Tests run: 1, Failures: 0, Errors: 0, Skipped: 0, Time elapsed: 0.438 sec - in org.appfuse.tool.DataHelperTest
Running org.appfuse.tool.StringUtilsTest
Tests run: 1, Failures: 0, Errors: 0, Skipped: 0, Time elapsed: 0.032 sec - in org.appfuse.tool.StringUtilsTest

Results :

Failed tests:
  InstallArtifactsMojoTest.testCreateStrutsProject:9 can't find test-project's pom.xml
Tests run: 27, Failures: 1, Errors: 0, Skipped: 0

[INFO] ------------------------------------------------------------------------
[INFO] Reactor Summary:
[INFO]
[INFO] AppFuse ............................................ SUCCESS [  0.452 s]
[INFO] AppFuse Data Modules ............................... SUCCESS [  0.008 s]
[INFO] AppFuse Common Data Module ......................... SUCCESS [  1.587 s]
[INFO] AppFuse Hibernate Module ........................... SUCCESS [  6.741 s]
[INFO] AppFuse JPA Module ................................. SUCCESS [  4.823 s]
[INFO] AppFuse Service Module ............................. SUCCESS [  7.063 s]
[INFO] AppFuse Plugin Modules ............................. SUCCESS [  0.006 s]
[INFO] AppFuse Maven Plugin ............................... FAILURE [ 37.356 s]
[INFO] AppFuse Web Modules ................................ SKIPPED
[INFO] AppFuse Common Web Module .......................... SKIPPED
[INFO] AppFuse JSF Module ................................. SKIPPED
[INFO] AppFuse Spring MVC Module .......................... SKIPPED
[INFO] AppFuse Struts 2 Module ............................ SKIPPED
[INFO] AppFuse Tapestry Module ............................ SKIPPED
[INFO] AppFuse Wicket Module .............................. SKIPPED
[INFO] AppFuse GWT Module ................................. SKIPPED
[INFO] AppFuse Archetype Modules .......................... SKIPPED
[INFO] AppFuse Core Archetype ............................. SKIPPED
[INFO] AppFuse Basic Archetype - JSF ...................... SKIPPED
[INFO] AppFuse Basic Archetype - Spring MVC ............... SKIPPED
[INFO] AppFuse Basic Archetype - Struts ................... SKIPPED
[INFO] AppFuse Basic Archetype - Tapestry ................. SKIPPED
[INFO] AppFuse Basic Archetype - Wicket ................... SKIPPED
[INFO] AppFuse Basic Archetype - GWT ...................... SKIPPED
[INFO] AppFuse Modular Archetype - JSF .................... SKIPPED
[INFO] AppFuse Modular Archetype - Struts ................. SKIPPED
[INFO] AppFuse Modular Archetype - Spring ................. SKIPPED
[INFO] AppFuse Modular Archetype - Tapestry ............... SKIPPED
[INFO] AppFuse Modular Archetype - Wicket ................. SKIPPED
[INFO] AppFuse Modular Archetype - GWT .................... SKIPPED
[INFO] AppFuse Web Services Archetype ..................... SKIPPED
[INFO] Maven WarPath Plugin ............................... SKIPPED
[INFO] ------------------------------------------------------------------------
[INFO] BUILD FAILURE
[INFO] ------------------------------------------------------------------------
[INFO] Total time: 59.449 s
[INFO] Finished at: 2015-01-19T17:56:55-08:00
[INFO] Final Memory: 88M/479M
[INFO] ------------------------------------------------------------------------


On Mon, Jan 19, 2015 at 4:56 PM, Matt Raible <[hidden email]> wrote:
Seems to work for me running "mvn clean install -Pitest". Bamboo seems good too: http://builds.appfuse.org/allPlans.action

[INFO] ------------------------------------------------------------------------
[INFO] Reactor Summary:
[INFO]
[INFO] AppFuse JSF Module ................................. SUCCESS [01:01 min]
[INFO] AppFuse Spring MVC Module .......................... SUCCESS [ 51.377 s]
[INFO] AppFuse Struts 2 Module ............................ SUCCESS [ 43.866 s]
[INFO] AppFuse Tapestry Module ............................ SUCCESS [01:01 min]
[INFO] AppFuse Wicket Module .............................. SUCCESS [ 40.837 s]
[INFO] AppFuse GWT Module ................................. SUCCESS [01:47 min]
[INFO] AppFuse Archetype Modules .......................... SUCCESS [  0.016 s]
[INFO] AppFuse Core Archetype ............................. SUCCESS [ 19.394 s]
[INFO] AppFuse Basic Archetype - JSF ...................... SUCCESS [01:18 min]
[INFO] AppFuse Basic Archetype - Spring MVC ............... SUCCESS [01:15 min]
[INFO] AppFuse Basic Archetype - Struts ................... SUCCESS [01:08 min]
[INFO] AppFuse Basic Archetype - Tapestry ................. SUCCESS [01:22 min]
[INFO] AppFuse Basic Archetype - Wicket ................... SUCCESS [06:16 min]
[INFO] AppFuse Basic Archetype - GWT ...................... SUCCESS [02:18 min]
[INFO] AppFuse Modular Archetype - JSF .................... SUCCESS [01:19 min]
[INFO] AppFuse Modular Archetype - Struts ................. SUCCESS [01:11 min]
[INFO] AppFuse Modular Archetype - Spring ................. SUCCESS [01:14 min]
[INFO] AppFuse Modular Archetype - Tapestry ............... SUCCESS [01:23 min]
[INFO] AppFuse Modular Archetype - Wicket ................. SUCCESS [01:05 min]
[INFO] AppFuse Modular Archetype - GWT .................... SUCCESS [02:12 min]
[INFO] AppFuse Web Services Archetype ..................... SUCCESS [ 24.459 s]
[INFO] Maven WarPath Plugin ............................... SUCCESS [  1.805 s]
[INFO] ------------------------------------------------------------------------
[INFO] BUILD SUCCESS
[INFO] ------------------------------------------------------------------------
[INFO] Total time: 29:00 min
[INFO] Finished at: 2015-01-19T17:48:45-07:00
[INFO] Final Memory: 159M/535M
[INFO] ------------------------------------------------------------------------
⌁49% ⌂95% [mraible:~/dev/appfuse] master 29m3s ±

On Mon, Jan 19, 2015 at 4:53 PM, Matt Raible <[hidden email]> wrote:
Yes, I’m working on AMP support for AppFuse Light modules. However, it’s on a branch so shouldn’t matter. Will look into it now...

> On Jan 19, 2015, at 4:49 PM, Serge Eby <[hidden email]> wrote:
>
> Hey Guys,
>
> Is the master branch still in flux?
> I get the following error when trying to build:
>
> INFO] BUILD FAILURE
> [INFO] ------------------------------------------------------------------------
> [INFO] Total time: 01:02 min
> [INFO] Finished at: 2015-01-19T15:46:55-08:00
> [INFO] Final Memory: 87M/477M
> [INFO] ------------------------------------------------------------------------
> [ERROR] Failed to execute goal org.apache.maven.plugins:maven-surefire-plugin:2.17:test (default-test) on project appfuse-maven-plugin: There are test failures.
> [ERROR]
>
> --
> Serge Eby





--
Serge Eby

Reply | Threaded
Open this post in threaded view
|

Re: Local build failing

mraible
Administrator
In reply to this post by Serge Eby-2
I upgraded and removed ~/.m2/repository/org/appfuse. This triggered the same error you’re seeing. I was expecting the modules to build in the order they’re defined in pom.xml, but it seems to ignore it (likely because it detects that archetypes depend on plugins).

To fix, run:

mvn install -f archetypes/pom.xml

Then running the whole build should work.

On Jan 19, 2015, at 7:19 PM, Serge Eby <[hidden email]> wrote:

Just to follow up on my previous email, it's still failing for me :(
Which versions of Maven & JDK are you using?

Some info on my settings:

$ mvn -version
Apache Maven 3.2.5 (12a6b3acb947671f09b81f49094c53f426d8cea1; 2014-12-14T09:29:23-08:00)
Maven home: /usr/local/maven
Java version: 1.7.0_71, vendor: Oracle Corporation
Java home: /Library/Java/JavaVirtualMachines/jdk1.7.0_71.jdk/Contents/Home/jre
Default locale: en_US, platform encoding: UTF-8
OS name: "mac os x", version: "10.10.1", arch: "x86_64", family: "mac"


$ ant -version
Apache Ant(TM) version 1.9.4 compiled on April 29 2014

-----------
Error message:

[ERROR] The desired archetype does not exist (org.appfuse.archetypes:appfuse-basic-struts-archetype:3.5.0-SNAPSHOT)
org.apache.maven.archetype.exception.UnknownArchetype: The desired archetype does not exist (org.appfuse.archetypes:appfuse-basic-struts-archetype:3.5.0-SNAPSHOT)
at org.apache.maven.archetype.generator.DefaultArchetypeGenerator.generateArchetype(DefaultArchetypeGenerator.java:112)
at org.apache.maven.archetype.generator.DefaultArchetypeGenerator.generateArchetype(DefaultArchetypeGenerator.java:286)
at org.apache.maven.archetype.DefaultArchetype.generateProjectFromArchetype(DefaultArchetype.java:69)
at org.appfuse.mojo.AbstractAppFuseMojoTestCase.createTestProject(AbstractAppFuseMojoTestCase.java:136)
at org.appfuse.mojo.installer.InstallArtifactsMojoTest.testCreateStrutsProject(InstallArtifactsMojoTest.java:8)
at sun.reflect.NativeMethodAccessorImpl.invoke0(Native Method)
at sun.reflect.NativeMethodAccessorImpl.invoke(NativeMethodAccessorImpl.java:57)
at sun.reflect.DelegatingMethodAccessorImpl.invoke(DelegatingMethodAccessorImpl.java:43)
at java.lang.reflect.Method.invoke(Method.java:606)
at junit.framework.TestCase.runTest(TestCase.java:176)
at junit.framework.TestCase.runBare(TestCase.java:141)
at junit.framework.TestResult$1.protect(TestResult.java:122)
at junit.framework.TestResult.runProtected(TestResult.java:142)
at junit.framework.TestResult.run(TestResult.java:125)
at junit.framework.TestCase.run(TestCase.java:129)
at junit.framework.TestSuite.runTest(TestSuite.java:252)
at junit.framework.TestSuite.run(TestSuite.java:247)
at org.junit.internal.runners.JUnit38ClassRunner.run(JUnit38ClassRunner.java:86)
at org.apache.maven.surefire.junit4.JUnit4Provider.execute(JUnit4Provider.java:264)
at org.apache.maven.surefire.junit4.JUnit4Provider.executeTestSet(JUnit4Provider.java:153)
at org.apache.maven.surefire.junit4.JUnit4Provider.invoke(JUnit4Provider.java:124)
at org.apache.maven.surefire.booter.ForkedBooter.invokeProviderInSameClassLoader(ForkedBooter.java:200)
at org.apache.maven.surefire.booter.ForkedBooter.runSuitesInProcess(ForkedBooter.java:153)
at org.apache.maven.surefire.booter.ForkedBooter.main(ForkedBooter.java:103)
Tests run: 1, Failures: 1, Errors: 0, Skipped: 0, Time elapsed: 0.494 sec <<< FAILURE! - in org.appfuse.mojo.installer.InstallArtifactsMojoTest
testCreateStrutsProject(org.appfuse.mojo.installer.InstallArtifactsMojoTest)  Time elapsed: 0.453 sec  <<< FAILURE!
junit.framework.AssertionFailedError: can't find test-project's pom.xml
at junit.framework.Assert.fail(Assert.java:57)
at junit.framework.Assert.assertTrue(Assert.java:22)
at junit.framework.TestCase.assertTrue(TestCase.java:192)
at org.appfuse.mojo.installer.InstallArtifactsMojoTest.testCreateStrutsProject(InstallArtifactsMojoTest.java:9)

Running org.appfuse.tool.DataHelperTest
Tests run: 1, Failures: 0, Errors: 0, Skipped: 0, Time elapsed: 0.438 sec - in org.appfuse.tool.DataHelperTest
Running org.appfuse.tool.StringUtilsTest
Tests run: 1, Failures: 0, Errors: 0, Skipped: 0, Time elapsed: 0.032 sec - in org.appfuse.tool.StringUtilsTest

Results :

Failed tests:
  InstallArtifactsMojoTest.testCreateStrutsProject:9 can't find test-project's pom.xml
Tests run: 27, Failures: 1, Errors: 0, Skipped: 0

[INFO] ------------------------------------------------------------------------
[INFO] Reactor Summary:
[INFO]
[INFO] AppFuse ............................................ SUCCESS [  0.452 s]
[INFO] AppFuse Data Modules ............................... SUCCESS [  0.008 s]
[INFO] AppFuse Common Data Module ......................... SUCCESS [  1.587 s]
[INFO] AppFuse Hibernate Module ........................... SUCCESS [  6.741 s]
[INFO] AppFuse JPA Module ................................. SUCCESS [  4.823 s]
[INFO] AppFuse Service Module ............................. SUCCESS [  7.063 s]
[INFO] AppFuse Plugin Modules ............................. SUCCESS [  0.006 s]
[INFO] AppFuse Maven Plugin ............................... FAILURE [ 37.356 s]
[INFO] AppFuse Web Modules ................................ SKIPPED
[INFO] AppFuse Common Web Module .......................... SKIPPED
[INFO] AppFuse JSF Module ................................. SKIPPED
[INFO] AppFuse Spring MVC Module .......................... SKIPPED
[INFO] AppFuse Struts 2 Module ............................ SKIPPED
[INFO] AppFuse Tapestry Module ............................ SKIPPED
[INFO] AppFuse Wicket Module .............................. SKIPPED
[INFO] AppFuse GWT Module ................................. SKIPPED
[INFO] AppFuse Archetype Modules .......................... SKIPPED
[INFO] AppFuse Core Archetype ............................. SKIPPED
[INFO] AppFuse Basic Archetype - JSF ...................... SKIPPED
[INFO] AppFuse Basic Archetype - Spring MVC ............... SKIPPED
[INFO] AppFuse Basic Archetype - Struts ................... SKIPPED
[INFO] AppFuse Basic Archetype - Tapestry ................. SKIPPED
[INFO] AppFuse Basic Archetype - Wicket ................... SKIPPED
[INFO] AppFuse Basic Archetype - GWT ...................... SKIPPED
[INFO] AppFuse Modular Archetype - JSF .................... SKIPPED
[INFO] AppFuse Modular Archetype - Struts ................. SKIPPED
[INFO] AppFuse Modular Archetype - Spring ................. SKIPPED
[INFO] AppFuse Modular Archetype - Tapestry ............... SKIPPED
[INFO] AppFuse Modular Archetype - Wicket ................. SKIPPED
[INFO] AppFuse Modular Archetype - GWT .................... SKIPPED
[INFO] AppFuse Web Services Archetype ..................... SKIPPED
[INFO] Maven WarPath Plugin ............................... SKIPPED
[INFO] ------------------------------------------------------------------------
[INFO] BUILD FAILURE
[INFO] ------------------------------------------------------------------------
[INFO] Total time: 59.449 s
[INFO] Finished at: 2015-01-19T17:56:55-08:00
[INFO] Final Memory: 88M/479M
[INFO] ------------------------------------------------------------------------


On Mon, Jan 19, 2015 at 4:56 PM, Matt Raible <[hidden email]> wrote:
Seems to work for me running "mvn clean install -Pitest". Bamboo seems good too: http://builds.appfuse.org/allPlans.action

[INFO] ------------------------------------------------------------------------
[INFO] Reactor Summary:
[INFO]
[INFO] AppFuse JSF Module ................................. SUCCESS [01:01 min]
[INFO] AppFuse Spring MVC Module .......................... SUCCESS [ 51.377 s]
[INFO] AppFuse Struts 2 Module ............................ SUCCESS [ 43.866 s]
[INFO] AppFuse Tapestry Module ............................ SUCCESS [01:01 min]
[INFO] AppFuse Wicket Module .............................. SUCCESS [ 40.837 s]
[INFO] AppFuse GWT Module ................................. SUCCESS [01:47 min]
[INFO] AppFuse Archetype Modules .......................... SUCCESS [  0.016 s]
[INFO] AppFuse Core Archetype ............................. SUCCESS [ 19.394 s]
[INFO] AppFuse Basic Archetype - JSF ...................... SUCCESS [01:18 min]
[INFO] AppFuse Basic Archetype - Spring MVC ............... SUCCESS [01:15 min]
[INFO] AppFuse Basic Archetype - Struts ................... SUCCESS [01:08 min]
[INFO] AppFuse Basic Archetype - Tapestry ................. SUCCESS [01:22 min]
[INFO] AppFuse Basic Archetype - Wicket ................... SUCCESS [06:16 min]
[INFO] AppFuse Basic Archetype - GWT ...................... SUCCESS [02:18 min]
[INFO] AppFuse Modular Archetype - JSF .................... SUCCESS [01:19 min]
[INFO] AppFuse Modular Archetype - Struts ................. SUCCESS [01:11 min]
[INFO] AppFuse Modular Archetype - Spring ................. SUCCESS [01:14 min]
[INFO] AppFuse Modular Archetype - Tapestry ............... SUCCESS [01:23 min]
[INFO] AppFuse Modular Archetype - Wicket ................. SUCCESS [01:05 min]
[INFO] AppFuse Modular Archetype - GWT .................... SUCCESS [02:12 min]
[INFO] AppFuse Web Services Archetype ..................... SUCCESS [ 24.459 s]
[INFO] Maven WarPath Plugin ............................... SUCCESS [  1.805 s]
[INFO] ------------------------------------------------------------------------
[INFO] BUILD SUCCESS
[INFO] ------------------------------------------------------------------------
[INFO] Total time: 29:00 min
[INFO] Finished at: 2015-01-19T17:48:45-07:00
[INFO] Final Memory: 159M/535M
[INFO] ------------------------------------------------------------------------
⌁49% ⌂95% [mraible:~/dev/appfuse] master 29m3s ±

On Mon, Jan 19, 2015 at 4:53 PM, Matt Raible <[hidden email]> wrote:
Yes, I’m working on AMP support for AppFuse Light modules. However, it’s on a branch so shouldn’t matter. Will look into it now...

> On Jan 19, 2015, at 4:49 PM, Serge Eby <[hidden email]> wrote:
>
> Hey Guys,
>
> Is the master branch still in flux?
> I get the following error when trying to build:
>
> INFO] BUILD FAILURE
> [INFO] ------------------------------------------------------------------------
> [INFO] Total time: 01:02 min
> [INFO] Finished at: 2015-01-19T15:46:55-08:00
> [INFO] Final Memory: 87M/477M
> [INFO] ------------------------------------------------------------------------
> [ERROR] Failed to execute goal org.apache.maven.plugins:maven-surefire-plugin:2.17:test (default-test) on project appfuse-maven-plugin: There are test failures.
> [ERROR]
>
> --
> Serge Eby





--
Serge Eby

Reply | Threaded
Open this post in threaded view
|

Re: Local build failing

Serge Eby-2
Great, thanks.

Serge

On Mon, Jan 19, 2015 at 7:06 PM, Matt Raible <[hidden email]> wrote:
I upgraded and removed ~/.m2/repository/org/appfuse. This triggered the same error you’re seeing. I was expecting the modules to build in the order they’re defined in pom.xml, but it seems to ignore it (likely because it detects that archetypes depend on plugins).

To fix, run:

mvn install -f archetypes/pom.xml

Then running the whole build should work.

On Jan 19, 2015, at 7:19 PM, Serge Eby <[hidden email]> wrote:

Just to follow up on my previous email, it's still failing for me :(
Which versions of Maven & JDK are you using?

Some info on my settings:

$ mvn -version
Apache Maven 3.2.5 (12a6b3acb947671f09b81f49094c53f426d8cea1; 2014-12-14T09:29:23-08:00)
Maven home: /usr/local/maven
Java version: 1.7.0_71, vendor: Oracle Corporation
Java home: /Library/Java/JavaVirtualMachines/jdk1.7.0_71.jdk/Contents/Home/jre
Default locale: en_US, platform encoding: UTF-8
OS name: "mac os x", version: "10.10.1", arch: "x86_64", family: "mac"


$ ant -version
Apache Ant(TM) version 1.9.4 compiled on April 29 2014

-----------
Error message:

[ERROR] The desired archetype does not exist (org.appfuse.archetypes:appfuse-basic-struts-archetype:3.5.0-SNAPSHOT)
org.apache.maven.archetype.exception.UnknownArchetype: The desired archetype does not exist (org.appfuse.archetypes:appfuse-basic-struts-archetype:3.5.0-SNAPSHOT)
at org.apache.maven.archetype.generator.DefaultArchetypeGenerator.generateArchetype(DefaultArchetypeGenerator.java:112)
at org.apache.maven.archetype.generator.DefaultArchetypeGenerator.generateArchetype(DefaultArchetypeGenerator.java:286)
at org.apache.maven.archetype.DefaultArchetype.generateProjectFromArchetype(DefaultArchetype.java:69)
at org.appfuse.mojo.AbstractAppFuseMojoTestCase.createTestProject(AbstractAppFuseMojoTestCase.java:136)
at org.appfuse.mojo.installer.InstallArtifactsMojoTest.testCreateStrutsProject(InstallArtifactsMojoTest.java:8)
at sun.reflect.NativeMethodAccessorImpl.invoke0(Native Method)
at sun.reflect.NativeMethodAccessorImpl.invoke(NativeMethodAccessorImpl.java:57)
at sun.reflect.DelegatingMethodAccessorImpl.invoke(DelegatingMethodAccessorImpl.java:43)
at java.lang.reflect.Method.invoke(Method.java:606)
at junit.framework.TestCase.runTest(TestCase.java:176)
at junit.framework.TestCase.runBare(TestCase.java:141)
at junit.framework.TestResult$1.protect(TestResult.java:122)
at junit.framework.TestResult.runProtected(TestResult.java:142)
at junit.framework.TestResult.run(TestResult.java:125)
at junit.framework.TestCase.run(TestCase.java:129)
at junit.framework.TestSuite.runTest(TestSuite.java:252)
at junit.framework.TestSuite.run(TestSuite.java:247)
at org.junit.internal.runners.JUnit38ClassRunner.run(JUnit38ClassRunner.java:86)
at org.apache.maven.surefire.junit4.JUnit4Provider.execute(JUnit4Provider.java:264)
at org.apache.maven.surefire.junit4.JUnit4Provider.executeTestSet(JUnit4Provider.java:153)
at org.apache.maven.surefire.junit4.JUnit4Provider.invoke(JUnit4Provider.java:124)
at org.apache.maven.surefire.booter.ForkedBooter.invokeProviderInSameClassLoader(ForkedBooter.java:200)
at org.apache.maven.surefire.booter.ForkedBooter.runSuitesInProcess(ForkedBooter.java:153)
at org.apache.maven.surefire.booter.ForkedBooter.main(ForkedBooter.java:103)
Tests run: 1, Failures: 1, Errors: 0, Skipped: 0, Time elapsed: 0.494 sec <<< FAILURE! - in org.appfuse.mojo.installer.InstallArtifactsMojoTest
testCreateStrutsProject(org.appfuse.mojo.installer.InstallArtifactsMojoTest)  Time elapsed: 0.453 sec  <<< FAILURE!
junit.framework.AssertionFailedError: can't find test-project's pom.xml
at junit.framework.Assert.fail(Assert.java:57)
at junit.framework.Assert.assertTrue(Assert.java:22)
at junit.framework.TestCase.assertTrue(TestCase.java:192)
at org.appfuse.mojo.installer.InstallArtifactsMojoTest.testCreateStrutsProject(InstallArtifactsMojoTest.java:9)

Running org.appfuse.tool.DataHelperTest
Tests run: 1, Failures: 0, Errors: 0, Skipped: 0, Time elapsed: 0.438 sec - in org.appfuse.tool.DataHelperTest
Running org.appfuse.tool.StringUtilsTest
Tests run: 1, Failures: 0, Errors: 0, Skipped: 0, Time elapsed: 0.032 sec - in org.appfuse.tool.StringUtilsTest

Results :

Failed tests:
  InstallArtifactsMojoTest.testCreateStrutsProject:9 can't find test-project's pom.xml
Tests run: 27, Failures: 1, Errors: 0, Skipped: 0

[INFO] ------------------------------------------------------------------------
[INFO] Reactor Summary:
[INFO]
[INFO] AppFuse ............................................ SUCCESS [  0.452 s]
[INFO] AppFuse Data Modules ............................... SUCCESS [  0.008 s]
[INFO] AppFuse Common Data Module ......................... SUCCESS [  1.587 s]
[INFO] AppFuse Hibernate Module ........................... SUCCESS [  6.741 s]
[INFO] AppFuse JPA Module ................................. SUCCESS [  4.823 s]
[INFO] AppFuse Service Module ............................. SUCCESS [  7.063 s]
[INFO] AppFuse Plugin Modules ............................. SUCCESS [  0.006 s]
[INFO] AppFuse Maven Plugin ............................... FAILURE [ 37.356 s]
[INFO] AppFuse Web Modules ................................ SKIPPED
[INFO] AppFuse Common Web Module .......................... SKIPPED
[INFO] AppFuse JSF Module ................................. SKIPPED
[INFO] AppFuse Spring MVC Module .......................... SKIPPED
[INFO] AppFuse Struts 2 Module ............................ SKIPPED
[INFO] AppFuse Tapestry Module ............................ SKIPPED
[INFO] AppFuse Wicket Module .............................. SKIPPED
[INFO] AppFuse GWT Module ................................. SKIPPED
[INFO] AppFuse Archetype Modules .......................... SKIPPED
[INFO] AppFuse Core Archetype ............................. SKIPPED
[INFO] AppFuse Basic Archetype - JSF ...................... SKIPPED
[INFO] AppFuse Basic Archetype - Spring MVC ............... SKIPPED
[INFO] AppFuse Basic Archetype - Struts ................... SKIPPED
[INFO] AppFuse Basic Archetype - Tapestry ................. SKIPPED
[INFO] AppFuse Basic Archetype - Wicket ................... SKIPPED
[INFO] AppFuse Basic Archetype - GWT ...................... SKIPPED
[INFO] AppFuse Modular Archetype - JSF .................... SKIPPED
[INFO] AppFuse Modular Archetype - Struts ................. SKIPPED
[INFO] AppFuse Modular Archetype - Spring ................. SKIPPED
[INFO] AppFuse Modular Archetype - Tapestry ............... SKIPPED
[INFO] AppFuse Modular Archetype - Wicket ................. SKIPPED
[INFO] AppFuse Modular Archetype - GWT .................... SKIPPED
[INFO] AppFuse Web Services Archetype ..................... SKIPPED
[INFO] Maven WarPath Plugin ............................... SKIPPED
[INFO] ------------------------------------------------------------------------
[INFO] BUILD FAILURE
[INFO] ------------------------------------------------------------------------
[INFO] Total time: 59.449 s
[INFO] Finished at: 2015-01-19T17:56:55-08:00
[INFO] Final Memory: 88M/479M
[INFO] ------------------------------------------------------------------------


On Mon, Jan 19, 2015 at 4:56 PM, Matt Raible <[hidden email]> wrote:
Seems to work for me running "mvn clean install -Pitest". Bamboo seems good too: http://builds.appfuse.org/allPlans.action

[INFO] ------------------------------------------------------------------------
[INFO] Reactor Summary:
[INFO]
[INFO] AppFuse JSF Module ................................. SUCCESS [01:01 min]
[INFO] AppFuse Spring MVC Module .......................... SUCCESS [ 51.377 s]
[INFO] AppFuse Struts 2 Module ............................ SUCCESS [ 43.866 s]
[INFO] AppFuse Tapestry Module ............................ SUCCESS [01:01 min]
[INFO] AppFuse Wicket Module .............................. SUCCESS [ 40.837 s]
[INFO] AppFuse GWT Module ................................. SUCCESS [01:47 min]
[INFO] AppFuse Archetype Modules .......................... SUCCESS [  0.016 s]
[INFO] AppFuse Core Archetype ............................. SUCCESS [ 19.394 s]
[INFO] AppFuse Basic Archetype - JSF ...................... SUCCESS [01:18 min]
[INFO] AppFuse Basic Archetype - Spring MVC ............... SUCCESS [01:15 min]
[INFO] AppFuse Basic Archetype - Struts ................... SUCCESS [01:08 min]
[INFO] AppFuse Basic Archetype - Tapestry ................. SUCCESS [01:22 min]
[INFO] AppFuse Basic Archetype - Wicket ................... SUCCESS [06:16 min]
[INFO] AppFuse Basic Archetype - GWT ...................... SUCCESS [02:18 min]
[INFO] AppFuse Modular Archetype - JSF .................... SUCCESS [01:19 min]
[INFO] AppFuse Modular Archetype - Struts ................. SUCCESS [01:11 min]
[INFO] AppFuse Modular Archetype - Spring ................. SUCCESS [01:14 min]
[INFO] AppFuse Modular Archetype - Tapestry ............... SUCCESS [01:23 min]
[INFO] AppFuse Modular Archetype - Wicket ................. SUCCESS [01:05 min]
[INFO] AppFuse Modular Archetype - GWT .................... SUCCESS [02:12 min]
[INFO] AppFuse Web Services Archetype ..................... SUCCESS [ 24.459 s]
[INFO] Maven WarPath Plugin ............................... SUCCESS [  1.805 s]
[INFO] ------------------------------------------------------------------------
[INFO] BUILD SUCCESS
[INFO] ------------------------------------------------------------------------
[INFO] Total time: 29:00 min
[INFO] Finished at: 2015-01-19T17:48:45-07:00
[INFO] Final Memory: 159M/535M
[INFO] ------------------------------------------------------------------------
⌁49% ⌂95% [mraible:~/dev/appfuse] master 29m3s ±

On Mon, Jan 19, 2015 at 4:53 PM, Matt Raible <[hidden email]> wrote:
Yes, I’m working on AMP support for AppFuse Light modules. However, it’s on a branch so shouldn’t matter. Will look into it now...

> On Jan 19, 2015, at 4:49 PM, Serge Eby <[hidden email]> wrote:
>
> Hey Guys,
>
> Is the master branch still in flux?
> I get the following error when trying to build:
>
> INFO] BUILD FAILURE
> [INFO] ------------------------------------------------------------------------
> [INFO] Total time: 01:02 min
> [INFO] Finished at: 2015-01-19T15:46:55-08:00
> [INFO] Final Memory: 87M/477M
> [INFO] ------------------------------------------------------------------------
> [ERROR] Failed to execute goal org.apache.maven.plugins:maven-surefire-plugin:2.17:test (default-test) on project appfuse-maven-plugin: There are test failures.
> [ERROR]
>
> --
> Serge Eby





--
Serge Eby




--
Serge Eby